Reaction Details
TargetPhosphatidylinositol 4,5-bisphosphate 3-kinase catalytic subunit alpha isoform
LigandBDBM50401268
Substrate/Competitorn/a
Meas. Tech.Alphascreen Assay
Ki 6±n/a nM
Citation Andrews, KLBo, YYBooker, SCee, VJD'Angelo, NHerberich, BJHong, FJackson, CLLanman, BALiao, HLiu, LNishimura, NNorman, MHPettus, LHReed, ABSmith, ALTadesse, STamayo, NAWu, BWurz, RYang, KC Inhibitors of PI3 kinase and/or mTOR US Patent US8772480 Publication Date 7/8/2014
 
Phosphatidylinositol 4,5-bisphosphate 3-kinase catalytic subunit alpha isoform
Name:Phosphatidylinositol 4,5-bisphosphate 3-kinase catalytic subunit alpha isoform
Type:Enzyme Subunit
Mol. Mass.:124294.87
Organism:Homo sapiens (Human)
Description:P42336
Residue:1068
BDBM50401268
NameBDBM50401268
Synonyms:CHEMBL2206914 | US8772480, 365
TypeSmall organic molecule
Emp. Form.C17H17ClN8O2S
Mol. Mass.432.887
SMILESCc1nc(N)nc(n1)-c1cccnc1Nc1cnc(Cl)c(NS(=O)(=O)C2CC2)c1