Reaction Details
TargetSerine/threonine-protein kinase mTOR
LigandBDBM125292
Substrate/Competitorn/a
Meas. Tech.In Vitro Inhibition Assay
IC50>10000±n/a nM
Citation Andrews, KLBo, YYBooker, SCee, VJD'Angelo, NHerberich, BJHong, FJackson, CLLanman, BALiao, HLiu, LNishimura, NNorman, MHPettus, LHReed, ABSmith, ALTadesse, STamayo, NAWu, BWurz, RYang, KC Inhibitors of PI3 kinase and/or mTOR US Patent US8772480 Publication Date 7/8/2014
 
Serine/threonine-protein kinase mTOR
Name:Serine/threonine-protein kinase mTOR
Type:Rapamycin target protein
Mol. Mass.:288917.12
Organism:Homo sapiens (Human)
Description:P42345
Residue:2549
BDBM125292
NameBDBM125292
Synonyms:US8772480, 104
TypeSmall organic molecule
Emp. Form.C26H22N8O2S
Mol. Mass.510.57
SMILESCc1nc(-c2cc(Cc3ccc(cc3)S(C)(=O)=O)cnc2Nc2cccc3[nH]ncc23)c2nc[nH]c2n1