Reaction Details
TargetSerine/threonine-protein kinase mTOR
LigandBDBM125361
Substrate/Competitorn/a
Meas. Tech.In Vitro Inhibition Assay
IC50>10000±n/a nM
Citation Andrews, KLBo, YYBooker, SCee, VJD'Angelo, NHerberich, BJHong, FJackson, CLLanman, BALiao, HLiu, LNishimura, NNorman, MHPettus, LHReed, ABSmith, ALTadesse, STamayo, NAWu, BWurz, RYang, KC Inhibitors of PI3 kinase and/or mTOR US Patent US8772480 Publication Date 7/8/2014
 
Serine/threonine-protein kinase mTOR
Name:Serine/threonine-protein kinase mTOR
Type:Rapamycin target protein
Mol. Mass.:288917.12
Organism:Homo sapiens (Human)
Description:P42345
Residue:2549
BDBM125361
NameBDBM125361
Synonyms:US8772480, 191
TypeSmall organic molecule
Emp. Form.C21H18FN9O
Mol. Mass.431.4257
SMILESCc1nc(N)nc(n1)-c1cccnc1Nc1ccc(NC(=O)Nc2cccc(F)c2)nc1