Reaction Details
TargetSerine/threonine-protein kinase mTOR
LigandBDBM50394860
Substrate/Competitorn/a
Meas. Tech.In Vitro Inhibition Assay
IC50>10000±n/a nM
Citation Andrews, KLBo, YYBooker, SCee, VJD'Angelo, NHerberich, BJHong, FJackson, CLLanman, BALiao, HLiu, LNishimura, NNorman, MHPettus, LHReed, ABSmith, ALTadesse, STamayo, NAWu, BWurz, RYang, KC Inhibitors of PI3 kinase and/or mTOR US Patent US8772480 Publication Date 7/8/2014
 
Serine/threonine-protein kinase mTOR
Name:Serine/threonine-protein kinase mTOR
Type:Rapamycin target protein
Mol. Mass.:288917.12
Organism:Homo sapiens (Human)
Description:P42345
Residue:2549
BDBM50394860
NameBDBM50394860
Synonyms:CHEMBL2165030 | US8772480, 256
TypeSmall organic molecule
Emp. Form.C20H21N7O2
Mol. Mass.391.4264
SMILESCOc1ccc(Nc2ncc(cc2-c2nc(C)nc(N)n2)C2=CCOCC2)cn1