Reaction Details
TargetSerine/threonine-protein kinase mTOR
LigandBDBM125440
Substrate/Competitorn/a
Meas. Tech.In Vitro Inhibition Assay
IC50>10000±n/a nM
Citation Andrews, KLBo, YYBooker, SCee, VJD'Angelo, NHerberich, BJHong, FJackson, CLLanman, BALiao, HLiu, LNishimura, NNorman, MHPettus, LHReed, ABSmith, ALTadesse, STamayo, NAWu, BWurz, RYang, KC Inhibitors of PI3 kinase and/or mTOR US Patent US8772480 Publication Date 7/8/2014
 
Serine/threonine-protein kinase mTOR
Name:Serine/threonine-protein kinase mTOR
Type:Rapamycin target protein
Mol. Mass.:288917.12
Organism:Homo sapiens (Human)
Description:P42345
Residue:2549
BDBM125440
NameBDBM125440
Synonyms:US8772480, 295
TypeSmall organic molecule
Emp. Form.C25H30FN9O3S
Mol. Mass.555.628
SMILESCOc1ncc(Nc2ncc(cc2-c2nc(C)nc3[nH]cnc23)[C@@H](C)N2CCN(C[C@@H]2C)S(C)(=O)=O)cc1F