Reaction Details
TargetSerine/threonine-protein kinase mTOR
LigandBDBM125457
Substrate/Competitorn/a
Meas. Tech.In Vitro Inhibition Assay
IC50>10000±n/a nM
Citation Andrews, KLBo, YYBooker, SCee, VJD'Angelo, NHerberich, BJHong, FJackson, CLLanman, BALiao, HLiu, LNishimura, NNorman, MHPettus, LHReed, ABSmith, ALTadesse, STamayo, NAWu, BWurz, RYang, KC Inhibitors of PI3 kinase and/or mTOR US Patent US8772480 Publication Date 7/8/2014
 
Serine/threonine-protein kinase mTOR
Name:Serine/threonine-protein kinase mTOR
Type:Rapamycin target protein
Mol. Mass.:288917.12
Organism:Homo sapiens (Human)
Description:P42345
Residue:2549
BDBM125457
NameBDBM125457
Synonyms:US8772480, 312
TypeSmall organic molecule
Emp. Form.C18H20FN7O2
Mol. Mass.385.3955
SMILESCOc1ncc(Nc2ncc(cc2-c2nc(C)nc(N)n2)C(C)CO)cc1F