Reaction Details
TargetSerine/threonine-protein kinase mTOR
LigandBDBM50401253
Substrate/Competitorn/a
Meas. Tech.In Vitro Inhibition Assay
IC50 26±n/a nM
Citation Andrews, KLBo, YYBooker, SCee, VJD'Angelo, NHerberich, BJHong, FJackson, CLLanman, BALiao, HLiu, LNishimura, NNorman, MHPettus, LHReed, ABSmith, ALTadesse, STamayo, NAWu, BWurz, RYang, KC Inhibitors of PI3 kinase and/or mTOR US Patent US8772480 Publication Date 7/8/2014
 
Serine/threonine-protein kinase mTOR
Name:Serine/threonine-protein kinase mTOR
Type:Rapamycin target protein
Mol. Mass.:288917.12
Organism:Homo sapiens (Human)
Description:P42345
Residue:2549
BDBM50401253
NameBDBM50401253
Synonyms:CHEMBL2206907 | US8772480, 328
TypeSmall organic molecule
Emp. Form.C20H23ClN8O3S
Mol. Mass.490.966
SMILESCc1nc(N)nc(n1)-c1cc(cnc1Nc1cnc(Cl)c(NS(C)(=O)=O)c1)C1CCOCC1