Reaction Details
TargetSerine/threonine-protein kinase mTOR
LigandBDBM125496
Substrate/Competitorn/a
Meas. Tech.In Vitro Inhibition Assay
IC50 1209±n/a nM
Citation Andrews, KLBo, YYBooker, SCee, VJD'Angelo, NHerberich, BJHong, FJackson, CLLanman, BALiao, HLiu, LNishimura, NNorman, MHPettus, LHReed, ABSmith, ALTadesse, STamayo, NAWu, BWurz, RYang, KC Inhibitors of PI3 kinase and/or mTOR US Patent US8772480 Publication Date 7/8/2014
 
Serine/threonine-protein kinase mTOR
Name:Serine/threonine-protein kinase mTOR
Type:Rapamycin target protein
Mol. Mass.:288917.12
Organism:Homo sapiens (Human)
Description:P42345
Residue:2549
BDBM125496
NameBDBM125496
Synonyms:US8772480, 362
TypeSmall organic molecule
Emp. Form.C22H30N10O3S
Mol. Mass.514.604
SMILESCOc1ncc(Nc2ncc(cc2-c2nc(C)nc(N)n2)[C@@H](C)N2CCN(C[C@@H]2C)S(C)(=O)=O)cn1