Reaction Details
TargetcAMP and cAMP-inhibited cGMP 3',5'-cyclic phosphodiesterase 10A
LigandBDBM125603
Substrate/Competitorn/a
Meas. Tech.Homogenous Time-Resolved Fluorescence Resonance Energy Transfer Assay
pH7.4±n/a
IC50 0.3±n/a nM
Commentsextracted
Citation Leblond, BDonello, JEChauvignac, CTaverne, TBeausoleil, ECasagrande, ADésiré, LPando, MPYang, R Substituted 6,7-dialkoxy-3-isoquinolinol derivatives as inhibitors of phosphodiesterase 10 (PDE10A) US Patent US8772316 Publication Date 7/8/2014
 
cAMP and cAMP-inhibited cGMP 3',5'-cyclic phosphodiesterase 10A
Name:cAMP and cAMP-inhibited cGMP 3',5'-cyclic phosphodiesterase 10A
Type:Protein
Mol. Mass.:88412.52
Organism:Homo sapiens (Human)
Description:Q9Y233
Residue:779
BDBM125603
NameBDBM125603
Synonyms:US8772316, 86
TypeSmall organic molecule
Emp. Form.C28H32FN3O4
Mol. Mass.493.5698
SMILESCCCc1[nH]c(=O)c(Cc2cc3cc(OCC)c(F)cc3nc2NCC)c2cc(OC)c(OC)cc12