Reaction Details
TargetDisintegrin and metalloproteinase domain-containing protein 9
LigandBDBM125925
Substrate/Competitorn/a
Meas. Tech.Enzymatic Assay
pH7.4±n/a
IC50>10000±n/a nM
Commentsextracted
Citation Clary, LChambon, SChantalat, LMauvais, PRoye, OSchuppli, M Benzenesulfonamide compounds, method for synthesizing same, and use thereof in medicine as well as in cosmetics US Patent US8772478 Publication Date 7/8/2014
 
Disintegrin and metalloproteinase domain-containing protein 9
Name:Disintegrin and metalloproteinase domain-containing protein 9
Type:Enzyme
Mol. Mass.:90567.68
Organism:Homo sapiens (Human)
Description:Q13443
Residue:819
BDBM125925
NameBDBM125925
Synonyms:US8772478, 14
TypeSmall organic molecule
Emp. Form.C24H28N4O6S
Mol. Mass.500.567
SMILESCc1cc(COc2ccc(cc2)S(=O)(=O)NC[C@H](N2CCOCC2)C(=O)NO)c2ccccc2n1