Reaction Details
TargetHistamine H3 receptor
LigandBDBM126004
Substrate/Competitorn/a
Meas. Tech.Functional Assay
Ki 0.9±0.0 nM
Citation Dorwald, FZHohlweg, RChristensen, ITLundbeck, JMAndersen, KE Benzothiazoles having histamine H3 receptor activity US Patent US8772285 Publication Date 7/8/2014
 
Histamine H3 receptor
Name:Histamine H3 receptor
Type:G Protein-Coupled Receptor (GPCR)
Mol. Mass.:48691.47
Organism:Homo sapiens (Human)
Description:Binding assays were using CHO cells stably expressing hH3R receptors.
Residue:445
BDBM126004
NameBDBM126004
Synonyms:US8772285, 27
TypeSmall organic molecule
Emp. Form.C18H24N4S
Mol. Mass.328.475
SMILESC(NC1CC1)c1ccc2nc(sc2c1)N1CCN(CC1)C1CC1