Reaction Details
TargetCalcitonin gene-related peptide 1
LigandBDBM126172
Substrate/Competitorn/a
Meas. Tech.Binding Assay
pH7.4±n/a
Temperature298.15±n/a K
Ki 2.9±n/a nM
Commentsextracted
Citation Stump, CAQuigley, AG CGRP receptor antagonists US Patent US8778957 Publication Date 7/15/2014
 
Calcitonin gene-related peptide 1
Name:Calcitonin gene-related peptide 1
Type:Enzyme
Mol. Mass.:13902.80
Organism:Homo sapiens (Human)
Description:P06881
Residue:128
BDBM126172
NameBDBM126172
Synonyms:US8778957, 19
TypeSmall organic molecule
Emp. Form.C27H22N4O2
Mol. Mass.434.4892
SMILESO=C1COc2ccccc2N1Cc1ccc2cc3C[C@]4(CNc5ncccc45)Cc3cc2n1