Reaction Details
TargetCalcitonin gene-related peptide 1
LigandBDBM126179
Substrate/Competitorn/a
Meas. Tech.Binding Assay
pH7.4±n/a
Temperature298.15±n/a K
Ki 43±n/a nM
Commentsextracted
Citation Stump, CAQuigley, AG CGRP receptor antagonists US Patent US8778957 Publication Date 7/15/2014
 
Calcitonin gene-related peptide 1
Name:Calcitonin gene-related peptide 1
Type:Enzyme
Mol. Mass.:13902.80
Organism:Homo sapiens (Human)
Description:P06881
Residue:128
BDBM126179
NameBDBM126179
Synonyms:US8778957, 69
TypeSmall organic molecule
Emp. Form.C33H31N5O2
Mol. Mass.529.6315
SMILESO=C1Nc2ncccc2[C@@]11Cc2cc3ccc(CN4CC5(CCCC5)NC(=O)C4c4ccccc4)nc3cc2C1