Reaction Details
TargetCalcitonin gene-related peptide 1
LigandBDBM126181
Substrate/Competitorn/a
Meas. Tech.Binding Assay
pH7.4±n/a
Temperature298.15±n/a K
Ki 150±n/a nM
Commentsextracted
Citation Stump, CAQuigley, AG CGRP receptor antagonists US Patent US8778957 Publication Date 7/15/2014
 
Calcitonin gene-related peptide 1
Name:Calcitonin gene-related peptide 1
Type:Enzyme
Mol. Mass.:13902.80
Organism:Homo sapiens (Human)
Description:P06881
Residue:128
BDBM126181
NameBDBM126181
Synonyms:US8778957, 27
TypeSmall organic molecule
Emp. Form.C26H27N5O
Mol. Mass.425.5255
SMILESCN1CC2CN(Cc3ccc4cc5CC6(Cc5cc4n3)C(=O)Nc3ncccc63)CC2C1