Reaction Details
TargetCalcitonin gene-related peptide 1
LigandBDBM126190
Substrate/Competitorn/a
Meas. Tech.Binding Assay
pH7.4±n/a
Temperature298.15±n/a K
Ki 180±n/a nM
Commentsextracted
Citation Stump, CAQuigley, AG CGRP receptor antagonists US Patent US8778957 Publication Date 7/15/2014
 
Calcitonin gene-related peptide 1
Name:Calcitonin gene-related peptide 1
Type:Enzyme
Mol. Mass.:13902.80
Organism:Homo sapiens (Human)
Description:P06881
Residue:128
BDBM126190
NameBDBM126190
Synonyms:US8778957, 45
TypeSmall organic molecule
Emp. Form.C30H25N5O
Mol. Mass.471.5524
SMILESO=C1Nc2ncccc2C11Cc2cc3ccc(CN4CCc5c(C4)[nH]c4ccccc54)nc3cc2C1