Reaction Details
TargetCyclin-T1
LigandBDBM126502
Substrate/Competitorn/a
Meas. Tech.IMAP Assay
IC50 0.0003±n/a nM
Citation Barsanti, PAHu, CJin, JKeyes, RKucejko, RLin, XPan, YPfister, KBSendzik, MSutton, JWan, L Heteroaryl compounds and their uses US Patent US8778951 Publication Date 7/15/2014
 
Cyclin-T1
Name:Cyclin-T1
Type:Enzyme Subunit
Mol. Mass.:80712.40
Organism:Homo sapiens (Human)
Description:n/a
Residue:726
BDBM126502
NameBDBM126502
Synonyms:US8778951, 312
TypeSmall organic molecule
Emp. Form.C23H31ClFN5O
Mol. Mass.447.977
SMILESCC1(CNc2nc(ccc2F)-c2cc(N[C@H]3CC[C@H](N)CC3)ncc2Cl)CCOCC1