Reaction Details
TargetCyclin-T1
LigandBDBM126516
Substrate/Competitorn/a
Meas. Tech.IMAP Assay
IC50 0.001±n/a nM
Citation Barsanti, PAHu, CJin, JKeyes, RKucejko, RLin, XPan, YPfister, KBSendzik, MSutton, JWan, L Heteroaryl compounds and their uses US Patent US8778951 Publication Date 7/15/2014
 
Cyclin-T1
Name:Cyclin-T1
Type:Enzyme Subunit
Mol. Mass.:80712.40
Organism:Homo sapiens (Human)
Description:n/a
Residue:726
BDBM126516
NameBDBM126516
Synonyms:US8778951, 327
TypeSmall organic molecule
Emp. Form.C26H37Cl2N5O2
Mol. Mass.522.51
SMILESCOC[C@@H](C)N[C@H]1CC[C@@H](CC1)Nc1cc(c(Cl)cn1)-c1nc(NC[C@H]2CCCOC2)ccc1Cl