Reaction Details
TargetCyclin-T1
LigandBDBM126537
Substrate/Competitorn/a
Meas. Tech.IMAP Assay
IC50 0.002±n/a nM
Citation Barsanti, PAHu, CJin, JKeyes, RKucejko, RLin, XPan, YPfister, KBSendzik, MSutton, JWan, L Heteroaryl compounds and their uses US Patent US8778951 Publication Date 7/15/2014
 
Cyclin-T1
Name:Cyclin-T1
Type:Enzyme Subunit
Mol. Mass.:80712.40
Organism:Homo sapiens (Human)
Description:n/a
Residue:726
BDBM126537
NameBDBM126537
Synonyms:US8778951, 348
TypeSmall organic molecule
Emp. Form.C27H37Cl2N5O3S
Mol. Mass.582.585
SMILESClc1ccc(NCC2CCOCC2)nc1-c1cc(NC2CCC(CC2)NC2CCS(=O)(=O)CC2)ncc1Cl