Reaction Details
TargetCyclin-T1
LigandBDBM126549
Substrate/Competitorn/a
Meas. Tech.IMAP Assay
IC50 0.00028±n/a nM
Citation Barsanti, PAHu, CJin, JKeyes, RKucejko, RLin, XPan, YPfister, KBSendzik, MSutton, JWan, L Heteroaryl compounds and their uses US Patent US8778951 Publication Date 7/15/2014
 
Cyclin-T1
Name:Cyclin-T1
Type:Enzyme Subunit
Mol. Mass.:80712.40
Organism:Homo sapiens (Human)
Description:n/a
Residue:726
BDBM126549
NameBDBM126549
Synonyms:US8778951, 360
TypeSmall organic molecule
Emp. Form.C25H33ClN6O
Mol. Mass.469.022
SMILESCCN[C@H]1CC[C@@H](CC1)Nc1cc(c(Cl)cn1)-c1cccc(NCC2(CCOCC2)C#N)n1