Reaction Details
TargetCyclin-T1
LigandBDBM126552
Substrate/Competitorn/a
Meas. Tech.IMAP Assay
IC50 0.00043±n/a nM
Citation Barsanti, PAHu, CJin, JKeyes, RKucejko, RLin, XPan, YPfister, KBSendzik, MSutton, JWan, L Heteroaryl compounds and their uses US Patent US8778951 Publication Date 7/15/2014
 
Cyclin-T1
Name:Cyclin-T1
Type:Enzyme Subunit
Mol. Mass.:80712.40
Organism:Homo sapiens (Human)
Description:n/a
Residue:726
BDBM126552
NameBDBM126552
Synonyms:US8778951, 363
TypeSmall organic molecule
Emp. Form.C28H37ClN6O2
Mol. Mass.525.085
SMILESClc1cnc(N[C@H]2CC[C@@H](CC2)NC2CCOCC2)cc1-c1cccc(NCC2(CCOCC2)C#N)n1