Reaction Details
TargetCyclin-T1
LigandBDBM126555
Substrate/Competitorn/a
Meas. Tech.IMAP Assay
IC50 0.001±n/a nM
Citation Barsanti, PAHu, CJin, JKeyes, RKucejko, RLin, XPan, YPfister, KBSendzik, MSutton, JWan, L Heteroaryl compounds and their uses US Patent US8778951 Publication Date 7/15/2014
 
Cyclin-T1
Name:Cyclin-T1
Type:Enzyme Subunit
Mol. Mass.:80712.40
Organism:Homo sapiens (Human)
Description:n/a
Residue:726
BDBM126555
NameBDBM126555
Synonyms:US8778951, 366
TypeSmall organic molecule
Emp. Form.C27H37ClN6O
Mol. Mass.497.075
SMILESCCN(CC)[C@H]1CC[C@@H](CC1)Nc1cc(c(Cl)cn1)-c1cccc(NCC2(CCOCC2)C#N)n1