Reaction Details
TargetRAC-beta serine/threonine-protein kinase
LigandBDBM126559
Substrate/Competitorn/a
Meas. Tech.Kinase Inhibition Assay
pH7.5±n/a
IC50 1.2±n/a nM
Commentsextracted
Citation Nakamura, MNiiyama, KKamijo, KOhkubo, MShimomura, T Imidazo-oxazine compound or salt thereof US Patent US8772283 Publication Date 7/8/2014
 
RAC-beta serine/threonine-protein kinase
Name:RAC-beta serine/threonine-protein kinase
Type:Enzyme
Mol. Mass.:55766.64
Organism:Homo sapiens (Human)
Description:n/a
Residue:481
BDBM126559
NameBDBM126559
Synonyms:US8772283, 3
TypeSmall organic molecule
Emp. Form.C26H22FN3O
Mol. Mass.411.4708
SMILESNC1(CCC1)c1ccc(cc1)-c1nc2-c3c(F)cccc3OCn2c1-c1ccccc1