Reaction Details
TargetRAC-beta serine/threonine-protein kinase
LigandBDBM126572
Substrate/Competitorn/a
Meas. Tech.Kinase Inhibition Assay
pH7.5±n/a
IC50 0.35±n/a nM
Commentsextracted
Citation Nakamura, MNiiyama, KKamijo, KOhkubo, MShimomura, T Imidazo-oxazine compound or salt thereof US Patent US8772283 Publication Date 7/8/2014
 
RAC-beta serine/threonine-protein kinase
Name:RAC-beta serine/threonine-protein kinase
Type:Enzyme
Mol. Mass.:55766.64
Organism:Homo sapiens (Human)
Description:n/a
Residue:481
BDBM126572
NameBDBM126572
Synonyms:US8772283, 16
TypeSmall organic molecule
Emp. Form.C30H29N3O3
Mol. Mass.479.5696
SMILESCOc1cccc2OCn3c(nc(c3-c3ccccc3)-c3ccc(cc3)C3(N)CC(O)(C3)C3CC3)-c12