Reaction Details
TargetRAC-beta serine/threonine-protein kinase
LigandBDBM126594
Substrate/Competitorn/a
Meas. Tech.Kinase Inhibition Assay
pH7.5±n/a
IC50 0.91±n/a nM
Commentsextracted
Citation Nakamura, MNiiyama, KKamijo, KOhkubo, MShimomura, T Imidazo-oxazine compound or salt thereof US Patent US8772283 Publication Date 7/8/2014
 
RAC-beta serine/threonine-protein kinase
Name:RAC-beta serine/threonine-protein kinase
Type:Enzyme
Mol. Mass.:55766.64
Organism:Homo sapiens (Human)
Description:n/a
Residue:481
BDBM126594
NameBDBM126594
Synonyms:US8772283, 38
TypeSmall organic molecule
Emp. Form.C28H26N4O2
Mol. Mass.450.5316
SMILESNC1(CC(O)(C1)C1CC1)c1ccc(cc1)-c1nc2-c3cccnc3OCn2c1-c1ccccc1