Reaction Details
TargetGag-Pol polyprotein
LigandBDBM126627
Substrate/Competitorn/a
Meas. Tech.Alphascreen Assay
pH7.4±n/a
Temperature277.15±n/a K
IC50 4480±n/a nM
Citation Bardiot, DChaltin, PChrist, FDebyser, ZDe Maeyer, MMarchand, AMarchand, DVoet, A Thieno [2, 3-B] pyridine derivatives as viral replication inhibitors US Patent US8785638 Publication Date 7/22/2014
 
Gag-Pol polyprotein
Name:Gag-Pol polyprotein
Type:Protein
Mol. Mass.:163312.58
Organism:Human immunodeficiency virus type 1 (HIV-1)
Description:P03367
Residue:1447
BDBM126627
NameBDBM126627
Synonyms:US8785638, 108
TypeSmall organic molecule
Emp. Form.C22H25NO2S
Mol. Mass.367.504
SMILESCCCC(C(O)=O)c1c(C)nc2sc(C)c(C)c2c1-c1ccc(C)cc1