Reaction Details
TargetGag-Pol polyprotein
LigandBDBM126679
Substrate/Competitorn/a
Meas. Tech.Alphascreen Assay
pH7.4±n/a
Temperature277.15±n/a K
IC50<1000±n/a nM
Citation Bardiot, DChaltin, PChrist, FDebyser, ZDe Maeyer, MMarchand, AMarchand, DVoet, A Thieno [2, 3-B] pyridine derivatives as viral replication inhibitors US Patent US8785638 Publication Date 7/22/2014
 
Gag-Pol polyprotein
Name:Gag-Pol polyprotein
Type:Protein
Mol. Mass.:163312.58
Organism:Human immunodeficiency virus type 1 (HIV-1)
Description:P03367
Residue:1447
BDBM126679
NameBDBM126679
Synonyms:US8785638, 165
TypeSmall organic molecule
Emp. Form.C25H27NO2S
Mol. Mass.405.552
SMILESCc1ccc(cc1)-c1c(C(CC2CC2)C(O)=O)c(C)nc2sc3CCCCc3c12