Reaction Details
TargetGag-Pol polyprotein
LigandBDBM126690
Substrate/Competitorn/a
Meas. Tech.Alphascreen Assay
pH7.4±n/a
Temperature277.15±n/a K
IC50 430±n/a nM
Citation Bardiot, DChaltin, PChrist, FDebyser, ZDe Maeyer, MMarchand, AMarchand, DVoet, A Thieno [2, 3-B] pyridine derivatives as viral replication inhibitors US Patent US8785638 Publication Date 7/22/2014
 
Gag-Pol polyprotein
Name:Gag-Pol polyprotein
Type:Protein
Mol. Mass.:163312.58
Organism:Human immunodeficiency virus type 1 (HIV-1)
Description:P03367
Residue:1447
BDBM126690
NameBDBM126690
Synonyms:US8785638, 186
TypeSmall organic molecule
Emp. Form.C25H26N2O3S2
Mol. Mass.466.616
SMILESCc1nc2sc3CCCCc3c2c(-c2ccc3ncsc3c2)c1C(OC(C)(C)C)C(O)=O