Reaction Details
TargetGag-Pol polyprotein
LigandBDBM126691
Substrate/Competitorn/a
Meas. Tech.Alphascreen Assay
pH7.4±n/a
Temperature277.15±n/a K
IC50 13670±n/a nM
Citation Bardiot, DChaltin, PChrist, FDebyser, ZDe Maeyer, MMarchand, AMarchand, DVoet, A Thieno [2, 3-B] pyridine derivatives as viral replication inhibitors US Patent US8785638 Publication Date 7/22/2014
 
Gag-Pol polyprotein
Name:Gag-Pol polyprotein
Type:Protein
Mol. Mass.:163312.58
Organism:Human immunodeficiency virus type 1 (HIV-1)
Description:P03367
Residue:1447
BDBM126691
NameBDBM126691
Synonyms:US8785638, 188
TypeSmall organic molecule
Emp. Form.C24H27NO3S2
Mol. Mass.441.606
SMILESCc1nc2sc3CCCCc3c2c(Sc2ccccc2)c1C(OC(C)(C)C)C(O)=O