Reaction Details
TargetSodium-dependent serotonin transporter
LigandBDBM126694
Substrate/Competitorn/a
Meas. Tech.Receptor Binding Assay
Temperature298.15±n/a K
Ki 72±n/a nM
Commentsextracted
Citation Toyoda, TNishida, TYoshinaga, H Benzyl piperidine compound US Patent US8778970 Publication Date 7/15/2014
 
Sodium-dependent serotonin transporter
Name:Sodium-dependent serotonin transporter
Type:Multi-pass membrane protein
Mol. Mass.:70322.51
Organism:Homo sapiens (Human)
Description:P31645
Residue:630
BDBM126694
NameBDBM126694
Synonyms:US8778970, 5-2
TypeSmall organic molecule
Emp. Form.C25H32BrNO4
Mol. Mass.490.43
SMILESOCCOc1cc(CC2CCN(CCc3ccc4OCCC(O)c4c3)CC2)ccc1Br