Reaction Details
TargetSodium-dependent serotonin transporter
LigandBDBM126697
Substrate/Competitorn/a
Meas. Tech.Receptor Binding Assay
Temperature298.15±n/a K
Ki 11±n/a nM
Commentsextracted
Citation Toyoda, TNishida, TYoshinaga, H Benzyl piperidine compound US Patent US8778970 Publication Date 7/15/2014
 
Sodium-dependent serotonin transporter
Name:Sodium-dependent serotonin transporter
Type:Multi-pass membrane protein
Mol. Mass.:70322.51
Organism:Homo sapiens (Human)
Description:P31645
Residue:630
BDBM126697
NameBDBM126697
Synonyms:US8778970, 5-5
TypeSmall organic molecule
Emp. Form.C23H26BrNO4
Mol. Mass.460.361
SMILESOC1COc2ccc(CCN3CCC(Cc4ccc(Br)c(O)c4)CC3)cc2C1=O