Reaction Details
TargetSodium-dependent serotonin transporter
LigandBDBM126703
Substrate/Competitorn/a
Meas. Tech.Receptor Binding Assay
Temperature298.15±n/a K
Ki 2.2±n/a nM
Commentsextracted
Citation Toyoda, TNishida, TYoshinaga, H Benzyl piperidine compound US Patent US8778970 Publication Date 7/15/2014
 
Sodium-dependent serotonin transporter
Name:Sodium-dependent serotonin transporter
Type:Multi-pass membrane protein
Mol. Mass.:70322.51
Organism:Homo sapiens (Human)
Description:P31645
Residue:630
BDBM126703
NameBDBM126703
Synonyms:US8778970, 5-11
TypeSmall organic molecule
Emp. Form.C26H33BrClNO5
Mol. Mass.554.901
SMILESCl.COCCOc1cc(CC2CCN(CC(O)c3ccc4OCCC(=O)c4c3)CC2)ccc1Br