Reaction Details
TargetSodium-dependent serotonin transporter
LigandBDBM126712
Substrate/Competitorn/a
Meas. Tech.Receptor Binding Assay
Temperature298.15±n/a K
Ki 228±n/a nM
Commentsextracted
Citation Toyoda, TNishida, TYoshinaga, H Benzyl piperidine compound US Patent US8778970 Publication Date 7/15/2014
 
Sodium-dependent serotonin transporter
Name:Sodium-dependent serotonin transporter
Type:Multi-pass membrane protein
Mol. Mass.:70322.51
Organism:Homo sapiens (Human)
Description:P31645
Residue:630
BDBM126712
NameBDBM126712
Synonyms:US8778970, RE2
TypeSmall organic molecule
Emp. Form.C14H20BrNO2
Mol. Mass.314.218
SMILESOCCOc1cc(CC2CCNCC2)ccc1Br