Reaction Details
Target5-hydroxytryptamine receptor 1A
LigandBDBM126710
Substrate/Competitorn/a
Meas. Tech.Receptor Binding Assay
Temperature298.15±n/a K
Ki 8.5±n/a nM
Commentsextracted
Citation Toyoda, TNishida, TYoshinaga, H Benzyl piperidine compound US Patent US8778970 Publication Date 7/15/2014
 
5-hydroxytryptamine receptor 1A
Name:5-hydroxytryptamine receptor 1A
Type:n/a
Mol. Mass.:46122.49
Organism:Homo sapiens (Human)
Description:n/a
Residue:422
BDBM126710
NameBDBM126710
Synonyms:US8778970, 5-15
TypeSmall organic molecule
Emp. Form.C23H28BrNO3
Mol. Mass.446.377
SMILESOC1CCOc2ccc(CCN3CCC(Cc4ccc(Br)c(O)c4)CC3)cc12