Reaction Details
TargetDimer of Gag-Pol polyprotein [489-587]
LigandBDBM4692
Substrate/CompetitorBDBM4685
Meas. Tech.Kinetic Competitive Displacement Assay
pH5.5±n/a
Temperature303.15±n/a K
Ki 0.00026±n/a nM
CommentsKi=r*KiGW0385, r is determined at equilibrium from measured [E[3H]GW0385] and total concentrations of E, [3H]GW0385, and compound.
Citation Miller, JFFurfine, ESHanlon, MHHazen, RJRay, JARobinson, LSamano, VSpaltenstein, A Novel arylsulfonamides possessing sub-picomolar HIV protease activities and potent anti-HIV activity against wild-type and drug-resistant viral strains. Bioorg Med Chem Lett14:959-63 (2004) 
 
Dimer of Gag-Pol polyprotein [489-587]
Name:Dimer of Gag-Pol polyprotein [489-587]
Synonyms:HIV-1 Protease
Type:Protein Complex
Mol. Mass.:n/a
Description:n/a
Components:This complex has 2 components.
Component 1
Name:Gag-Pol polyprotein [489-587]
Type:Enzyme Subunit
Mol. Mass.:10822.21
Organism:Human immunodeficiency virus type 1
Description:P12497[489-587]
Residue:99
Component 2
Name:Gag-Pol polyprotein [489-587]
Synonyms:HIV protease HIV-1 Protease chain A POL_HV1N5 | gag-pol
Type:Enzyme Subunit
Mol. Mass.:10822.21
Organism:Human immunodeficiency virus type 1
Description:P12497[489-587]
Residue:99
BDBM4692
BDBM4685
NameBDBM4692
Synonyms:(3R,3aS,6aR)-hexahydrofuro[2,3-b]furan-3-yl N-[(2S,3R)-4-[(4-aminobenzene)({5-[(methoxycarbonyl)amino]-2,2-dimethylpentyl})sulfonamido]-3-hydroxy-1-phenylbutan-2-yl]carbamate | arylsulfonamide 11a
TypeSmall organic molecule
Emp. Form.C32H46N4O9S
Mol. Mass.662.794
SMILES[H][C@@]12CCO[C@]1([H])OC[C@@H]2OC(=O)N[C@@H](Cc1ccccc1)[C@H](O)CN(CC(C)(C)CCCNC(=O)OC)S(=O)(=O)c1ccc(N)cc1