Reaction Details
TargetCollagenase 3
LigandBDBM50361634
Substrate/Competitorn/a
Meas. Tech.Biological Assay
IC50 3±n/a nM
Citation Abeywardane, AFarmer, BFarrow, NAGao, DAHeim-Riether, ASmith Keenan, LLMugge, IATaylor, SJXiong, ZYu, YZhang, Q Heteroaryl substituted indole compounds useful as MMP-13 inhibitors US Patent US8785489 Publication Date 7/22/2014
 
Collagenase 3
Name:Collagenase 3
Type:Protein
Mol. Mass.:54166.75
Organism:Mus musculus (Mouse)
Description:Q3U9V5
Residue:472
BDBM50361634
NameBDBM50361634
Synonyms:CHEMBL1939877 | US8785489, (4-{[({5-[2-(ethoxycarbonyl)-1H-indol-5-yl]-1-methyl-1H-pyrazol-3-yl}carbonyl)amino]methyl}phenyl)acetic acid
TypeSmall organic molecule
Emp. Form.C25H24N4O5
Mol. Mass.460.4819
SMILESCCOC(=O)c1cc2cc(ccc2[nH]1)-c1cc(nn1C)C(=O)NCc1ccc(CC(O)=O)cc1