Reaction Details
TargetcAMP and cAMP-inhibited cGMP 3',5'-cyclic phosphodiesterase 10A
LigandBDBM126827
Substrate/Competitorn/a
Meas. Tech.Fluorescence Polarization Assay
Ki 0.040±n/a nM
Citation Cox, CDRaheem, ITShipe, WDTheberge, CR Alkoxy pyrimidine PDE10 inhibitors US Patent US8785467 Publication Date 7/22/2014
 
cAMP and cAMP-inhibited cGMP 3',5'-cyclic phosphodiesterase 10A
Name:cAMP and cAMP-inhibited cGMP 3',5'-cyclic phosphodiesterase 10A
Type:Protein
Mol. Mass.:88412.52
Organism:Homo sapiens (Human)
Description:Q9Y233
Residue:1055
BDBM126827
NameBDBM126827
Synonyms:US8785467, 1-32
TypeSmall organic molecule
Emp. Form.C21H21ClN6O2S
Mol. Mass.456.948
SMILESCc1nc(C)c(CNc2nc(OCCOc3ccc4cccnc4n3)nc(Cl)c2C)s1