Reaction Details
TargetcAMP and cAMP-inhibited cGMP 3',5'-cyclic phosphodiesterase 10A
LigandBDBM126829
Substrate/Competitorn/a
Meas. Tech.Fluorescence Polarization Assay
Ki 0.0006±n/a nM
Citation Cox, CDRaheem, ITShipe, WDTheberge, CR Alkoxy pyrimidine PDE10 inhibitors US Patent US8785467 Publication Date 7/22/2014
 
cAMP and cAMP-inhibited cGMP 3',5'-cyclic phosphodiesterase 10A
Name:cAMP and cAMP-inhibited cGMP 3',5'-cyclic phosphodiesterase 10A
Type:Protein
Mol. Mass.:88412.52
Organism:Homo sapiens (Human)
Description:Q9Y233
Residue:779
BDBM126829
NameBDBM126829
Synonyms:US8785467, 1-38
TypeSmall organic molecule
Emp. Form.C24H24ClN5OS
Mol. Mass.465.998
SMILESCc1nc(C)c(CNc2nc(OC[C@@H]3C[C@H]3c3ccc4ccccc4n3)nc(Cl)c2C)s1