Reaction Details
TargetProstaglandin D2 receptor 2
LigandBDBM127164
Substrate/Competitorn/a
Meas. Tech.Radioligand Binding Assay
pH7.4±n/a
Ki 0.2±n/a nM
Commentsextracted
Citation Oost, TAnderskewitz, RHamprecht, DWHoenke, CMartyres, DRist, WSeither, P Pyrazole compounds as CRTH2 antagonists US Patent US8791272 Publication Date 7/29/2014
 
Prostaglandin D2 receptor 2
Name:Prostaglandin D2 receptor 2
Type:Enzyme
Mol. Mass.:43295.45
Organism:Homo sapiens (Human)
Description:Q9Y5Y4
Residue:395
BDBM127164
NameBDBM127164
Synonyms:US8791272, 2.40
TypeSmall organic molecule
Emp. Form.C25H27Cl2N3O3
Mol. Mass.488.406
SMILESCCCc1nn(Cc2ccc(NC(=O)c3ccc(Cl)c(Cl)c3)cc2)c(C(C)C)c1CC(O)=O