Reaction Details
TargetProstaglandin D2 receptor 2
LigandBDBM127191
Substrate/Competitorn/a
Meas. Tech.Radioligand Binding Assay
pH7.4±n/a
Ki 0.1±n/a nM
Commentsextracted
Citation Oost, TAnderskewitz, RHamprecht, DWHoenke, CMartyres, DRist, WSeither, P Pyrazole compounds as CRTH2 antagonists US Patent US8791272 Publication Date 7/29/2014
 
Prostaglandin D2 receptor 2
Name:Prostaglandin D2 receptor 2
Type:Enzyme
Mol. Mass.:43295.45
Organism:Homo sapiens (Human)
Description:Q9Y5Y4
Residue:395
BDBM127191
NameBDBM127191
Synonyms:US8791272, 3.9
TypeSmall organic molecule
Emp. Form.C24H25Cl2N3O4
Mol. Mass.490.379
SMILESCCc1nn(Cc2ccc(NC(=O)OCc3ccc(Cl)c(Cl)c3)cc2)c(CC)c1CC(O)=O