Reaction Details
TargetProstaglandin D2 receptor 2
LigandBDBM127217
Substrate/Competitorn/a
Meas. Tech.Radioligand Binding Assay
pH7.4±n/a
Ki 1.3±n/a nM
Commentsextracted
Citation Oost, TAnderskewitz, RHamprecht, DWHoenke, CMartyres, DRist, WSeither, P Pyrazole compounds as CRTH2 antagonists US Patent US8791272 Publication Date 7/29/2014
 
Prostaglandin D2 receptor 2
Name:Prostaglandin D2 receptor 2
Type:Enzyme
Mol. Mass.:43295.45
Organism:Homo sapiens (Human)
Description:Q9Y5Y4
Residue:395
BDBM127217
NameBDBM127217
Synonyms:US8791272, 7.13
TypeSmall organic molecule
Emp. Form.C25H22ClN3O3
Mol. Mass.447.913
SMILESCc1nn(Cc2ccc(NC(=O)c3ccc4ccccc4c3)cc2Cl)c(C)c1CC(O)=O