Reaction Details
TargetProstaglandin D2 receptor 2
LigandBDBM127218
Substrate/Competitorn/a
Meas. Tech.Radioligand Binding Assay
pH7.4±n/a
Ki 1.6±n/a nM
Commentsextracted
Citation Oost, TAnderskewitz, RHamprecht, DWHoenke, CMartyres, DRist, WSeither, P Pyrazole compounds as CRTH2 antagonists US Patent US8791272 Publication Date 7/29/2014
 
Prostaglandin D2 receptor 2
Name:Prostaglandin D2 receptor 2
Type:Enzyme
Mol. Mass.:43295.45
Organism:Homo sapiens (Human)
Description:Q9Y5Y4
Residue:395
BDBM127218
NameBDBM127218
Synonyms:US8791272, 7.14
TypeSmall organic molecule
Emp. Form.C23H21ClF3N3O3
Mol. Mass.479.879
SMILESCc1nn(Cc2ccc(NC(=O)c3ccc(cc3C)C(F)(F)F)cc2Cl)c(C)c1CC(O)=O