Reaction Details
TargetProstaglandin D2 receptor 2
LigandBDBM127296
Substrate/Competitorn/a
Meas. Tech.Radioligand Binding Assay
pH7.4±n/a
Ki 0.1±n/a nM
Commentsextracted
Citation Oost, TAnderskewitz, RHamprecht, DWHoenke, CMartyres, DRist, WSeither, P Pyrazole compounds as CRTH2 antagonists US Patent US8791272 Publication Date 7/29/2014
 
Prostaglandin D2 receptor 2
Name:Prostaglandin D2 receptor 2
Type:Enzyme
Mol. Mass.:43295.45
Organism:Homo sapiens (Human)
Description:Q9Y5Y4
Residue:395
BDBM127296
NameBDBM127296
Synonyms:US8791272, 17.1
TypeSmall organic molecule
Emp. Form.C25H26F3N3O3
Mol. Mass.473.4874
SMILESCCc1nn(C(C)c2ccc(NC(=O)c3ccc(cc3)C(F)(F)F)cc2)c(CC)c1CC(O)=O