Reaction Details
TargetNeuraminidase
LigandBDBM4713
Substrate/CompetitorBDBM4702
Meas. Tech.Neuraminidase Inhibition Assay
pH6.5±n/a
Temperature310.15±n/a K
IC50 5000±n/a nM
Citation Chand, PBabu, YSBantia, SChu, NCole, LBKotian, PLLaver, WGMontgomery, JAPathak, VPPetty, SLShrout, DPWalsh, DAWalsh, GM Design and synthesis of benzoic acid derivatives as influenza neuraminidase inhibitors using structure-based drug design. J Med Chem40:4030-52 (1997) 
 
Neuraminidase
Name:Neuraminidase
Type:Enzyme
Mol. Mass.:52468.81
Organism:Influenza A virus (N9)
Description:P03472
Residue:470
BDBM4713
BDBM4702
NameBDBM4713
Synonyms:3-[(Aminoiminomethyl)amino]-4-[(methylamino)carbonyl]benzoic Acid Benzoic Acid deriv. 160
TypeSmall organic molecule
Emp. Form.C10H12N4O3
Mol. Mass.236.2273
SMILES[#6]-[#7]-[#6](=O)-c1ccc(cc1\[#7]=[#6](/[#7])-[#7])-[#6](-[#8])=O