Reaction Details
TargetPhosphatidylinositol 4,5-bisphosphate 3-kinase catalytic subunit alpha isoform
LigandBDBM127408
Substrate/Competitorn/a
Meas. Tech.Biochemical Assay
pH7.4±n/a
Temperature298.15±n/a K
Ki 0.882±n/a nM
Commentsextracted
Citation Cheng, HJohnson, TWHoffman, JEGuo, LCLiu, Z Imidazo[1,5]naphthyridine compounds, their pharmaceutical use and compositions US Patent US8791131 Publication Date 7/29/2014
 
Phosphatidylinositol 4,5-bisphosphate 3-kinase catalytic subunit alpha isoform
Name:Phosphatidylinositol 4,5-bisphosphate 3-kinase catalytic subunit alpha isoform
Type:Enzyme Subunit
Mol. Mass.:124294.87
Organism:Homo sapiens (Human)
Description:P42336
Residue:1068
BDBM127408
NameBDBM127408
Synonyms:US8791131, 176
TypeSmall organic molecule
Emp. Form.C23H25N7O2
Mol. Mass.431.4903
SMILESCc1ccc(cn1)-c1ccc2ncc3n(C)c(=O)n(C4CCN(CC(N)=O)CC4)c3c2n1