Reaction Details
TargetSerine/threonine-protein kinase mTOR
LigandBDBM127374
Substrate/Competitorn/a
Meas. Tech.Biochemical Assay
pH7.5±n/a
Temperature298.15±n/a K
Ki 1.39±n/a nM
Commentsextracted
Citation Cheng, HJohnson, TWHoffman, JEGuo, LCLiu, Z Imidazo[1,5]naphthyridine compounds, their pharmaceutical use and compositions US Patent US8791131 Publication Date 7/29/2014
 
Serine/threonine-protein kinase mTOR
Name:Serine/threonine-protein kinase mTOR
Type:Rapamycin target protein
Mol. Mass.:288917.12
Organism:Homo sapiens (Human)
Description:P42345
Residue:2549
BDBM127374
NameBDBM127374
Synonyms:US8791131, 132
TypeSmall organic molecule
Emp. Form.C21H21N5O3
Mol. Mass.391.4231
SMILESCOc1ccc(cn1)-c1ccc2ncc3[nH]c(=O)n([C@H]4CC[C@H](O)CC4)c3c2n1