Reaction Details
TargetSerine/threonine-protein kinase mTOR
LigandBDBM50428113
Substrate/Competitorn/a
Meas. Tech.Biochemical Assay
pH7.5±n/a
Temperature298.15±n/a K
Ki 0.842±n/a nM
Commentsextracted
Citation Cheng, HJohnson, TWHoffman, JEGuo, LCLiu, Z Imidazo[1,5]naphthyridine compounds, their pharmaceutical use and compositions US Patent US8791131 Publication Date 7/29/2014
 
Serine/threonine-protein kinase mTOR
Name:Serine/threonine-protein kinase mTOR
Type:Rapamycin target protein
Mol. Mass.:288917.12
Organism:Homo sapiens (Human)
Description:P42345
Residue:2549
BDBM50428113
NameBDBM50428113
Synonyms:CHEMBL2331663 | US8791131, 172
TypeSmall organic molecule
Emp. Form.C23H24N6O3
Mol. Mass.432.4751
SMILESCc1ccc(cn1)-c1ccc2ncc3n(C)c(=O)n(C4CCN(CC4)C(=O)CO)c3c2n1