Reaction Details
TargetSerine/threonine-protein kinase mTOR
LigandBDBM127440
Substrate/Competitorn/a
Meas. Tech.Biochemical Assay
pH7.5±n/a
Temperature298.15±n/a K
Ki 1.74±n/a nM
Commentsextracted
Citation Cheng, HJohnson, TWHoffman, JEGuo, LCLiu, Z Imidazo[1,5]naphthyridine compounds, their pharmaceutical use and compositions US Patent US8791131 Publication Date 7/29/2014
 
Serine/threonine-protein kinase mTOR
Name:Serine/threonine-protein kinase mTOR
Type:Rapamycin target protein
Mol. Mass.:288917.12
Organism:Homo sapiens (Human)
Description:P42345
Residue:2549
BDBM127440
NameBDBM127440
Synonyms:US8791131, 214
TypeSmall organic molecule
Emp. Form.C25H29N7O3
Mol. Mass.475.5429
SMILESC[C@@H](O)C(=O)N1CCC(CC1)n1c2c(cnc3ccc(nc23)-c2ccc(nc2)N(C)C)n(C)c1=O