Reaction Details
TargetLeucine-rich repeat serine/threonine-protein kinase 2
LigandBDBM127895
Substrate/Competitorn/a
Meas. Tech.Lanthascreen Binding Assay
Ki 1±n/a nM
Citation Baker-Glenn, CChambers, MChan, BKEstrada, ASweeney, ZK Aminopyrimidine derivatives as LRRK2 modulators US Patent US8791130 Publication Date 7/29/2014
 
Leucine-rich repeat serine/threonine-protein kinase 2
Name:Leucine-rich repeat serine/threonine-protein kinase 2
Type:Protein
Mol. Mass.:286113.20
Organism:Homo sapiens (Human)
Description:Q5S007
Residue:2527
BDBM127895
NameBDBM127895
Synonyms:US8791130, 25
TypeSmall organic molecule
Emp. Form.C17H17F3N6O
Mol. Mass.378.3517
SMILESCNc1nc(Nc2ccc(cc2OC)-c2ccnn2C)ncc1C(F)(F)F