Reaction Details
TargetLeucine-rich repeat serine/threonine-protein kinase 2
LigandBDBM127896
Substrate/Competitorn/a
Meas. Tech.Lanthascreen Binding Assay
Ki 1±n/a nM
Citation Baker-Glenn, CChambers, MChan, BKEstrada, ASweeney, ZK Aminopyrimidine derivatives as LRRK2 modulators US Patent US8791130 Publication Date 7/29/2014
 
Leucine-rich repeat serine/threonine-protein kinase 2
Name:Leucine-rich repeat serine/threonine-protein kinase 2
Type:Protein
Mol. Mass.:286113.20
Organism:Homo sapiens (Human)
Description:Q5S007
Residue:2527
BDBM127896
NameBDBM127896
Synonyms:US8791130, 26
TypeSmall organic molecule
Emp. Form.C18H18F3N5O2
Mol. Mass.393.363
SMILESCNc1nc(Nc2ccc(cc2OC)-c2c(C)noc2C)ncc1C(F)(F)F