Reaction Details
TargetTyrosine-protein kinase SYK
LigandBDBM128011
Substrate/Competitorn/a
Meas. Tech.Homogeneous Time-Resolved Fluorescence Assay
pH7.5±n/a
IC50<0.50±n/a nM
Commentsextracted
Citation Romeo, ETMachacek, MRTrotter, BWMiller, TAAndresen, BMAnthony, NJTaoka, BMLiu, Y Amino-pyridine-containing spleen tyrosine kinase (SYK) inhibitors US Patent US8796310 Publication Date 8/5/2014
 
Tyrosine-protein kinase SYK
Name:Tyrosine-protein kinase SYK
Type:Enzyme
Mol. Mass.:72079.99
Organism:Homo sapiens (Human)
Description:P43405
Residue:635
BDBM128011
NameBDBM128011
Synonyms:US8796310, 29C
TypeSmall organic molecule
Emp. Form.C28H28N4O4S
Mol. Mass.516.611
SMILESCCCOc1ccnc(Nc2cc(C)cc(n2)-c2cnc(s2)[C@@]2(O)CCCc3cc(ccc23)C(O)=O)c1